دیوار حایل وزنی
type: Concept
broader: دیوار حایل
preferred label: gravity retaining wall @en
scope note: دیواری که وزن آن سبب ایستایی در برابر نیروهای جانبی شود.

دیوار حایل
type: Concept
narrower: دیوار حایل وزنی
preferred label: retaining wall @en