دیوار توپر
type: Concept
broader: دیوار (بخش سازه‌ای)
preferred label: solid wall @en
scope note: دیوار یکپارچه‌ای که از مصالح پیوسته تشکیل شده باشد.

دیوار (بخش سازه‌ای)
type: Concept
narrower: دیوار توپر
preferred label: wall (structural partition) @en