تورم قلیایی
type: Concept
broader: آماس
preferred label: alkali swelling @en
scope note: تشکیل ژل در بتن در نتیجۀ جذب آب توسط سیلیس‌های بی‌شکل یا شن‌های دارای تبلور ضعیف و متعاقب آن ایجاد تورم که سبب کاهش استحکام یا تخریب کامل بتن می‌شود.

آماس
type: Concept
narrower: تورم قلیایی
preferred label: swelling @en