آنتروپی کنانشی
type: Concept
alternative label: آنتروپی فعال‌سازی
broader: آنتروپی
preferred label: activation entropy @en
scope note: اختلاف آنتروپی حالت گذار با حاصلِ‌جمع آنتروپی‌های عوامل واکنش در حالت پایه

آنتروپی
type: Concept
narrower: آنتروپی کنانشی
preferred label: entropy @en