refraction tomography
type: Concept
alternative label: seismic refraction tomography
broader: tomography
preferred label: برش‌نگاری شکستی @fa
scope note: نوعی برش‌نگاری بر پایۀ داده‌های لرزه‌ای شکستِ مرزی سطح‌به‌سطح @fa

tomography
type: Concept
narrower: refraction tomography
preferred label: برش‌نگاری @fa