مین‌گذار
type: Concept
broader: کشتی
preferred label: mine planter ship @en
scope note: شناوری که ویژۀ مین‌گذاری طراحی و ساخته شده است.

کشتی
type: Concept
narrower: مین‌گذار
preferred label: ship @en