کشتی روروبارگنجی
type: Concept
broader: کشتی رورو
preferred label: ro-ro/container ship @en

کشتی رورو
type: Concept
alternative label: شناور رورو
broader: کشتی
narrower: کشتی روروبارگنجی
preferred label: ro-ro ship @en
scope note: نوعی کشتی که در طراحی آن امکان بارگیری و تخلیۀ خودرو و وسایل باربَری جاده‌ای و چرخ‌بار و قطار ازطریق شیب‌راهه در نظر گرفته شده است.

کشتی
type: Concept
narrower: کشتی رورو
preferred label: ship @en