پسماند ناسازگار
type: Concept
broader: پسماند
preferred label: incompatible waste @en
scope note: پسماند خطرناکی که به‌‌خودیخود در محل یا در مجاورت یا اختلاط با مواد یا پسماندهای دیگر ممکن است واکنش دهد و اثرات نامطلوب بر جای گذارد.

پسماند
type: Concept
narrower: پسماند ناسازگار
preferred label: waste @en