نخاله ساختمانی
type: Concept
broader: پسماند شهری
preferred label: construction and demolition waste @en
scope note: مواد حاصل از عملیات ساخت و بازسازی و تعمیر یا تخریب هرنوع سازه

پسماند شهری
type: Concept
narrower: نخاله ساختمانی
preferred label: municipal waste @en