پسماند پرتوزا
type: Concept
narrower: پسماند کم‏پرتو
preferred label: radioactive waste @en

پسماند کم‏پرتو
type: Concept
broader: پسماند پرتوزا
preferred label: low level radioactive waste @en
scope note: مواد زاید پرتوزای حاصل از فعالیت واکنشگاه‌ها/ رآکتورها که فعالیت کمی داشته باشند.