تصفیه تکمیلی فاضلاب
type: Concept
broader: تصفیه فاضلاب
preferred label: advanced wastewater treatment @en
scope note: هرگونه فرایند تصفیۀ فیزیکی یا شیمیایی یا زیستی که برای انجام تصفیه‌ای بیشتر از تصفیۀ ثانویه به کار می‏رود.

تصفیه فاضلاب
type: Concept
narrower: تصفیه تکمیلی فاضلاب
preferred label: wastewater treatment @en