فعال‌سازی شیمیایی
preferred label: chemical activation @en
type: Concept
related: انرژی فعال‌سازی

انرژی فعال‌سازی
scope note: مقدار انرژی لازم، افزون بر انرژی حالت پایه، که باید به یک سامانۀ مولکولی یا اتمی اضافه شود تا انجام یک فرایند خاص امکان‌پذیر گردد
related: فعال‌سازی شیمیایی
related: شیمی‌فیزیک
preferred label: activation energy @en
type: Concept

شیمی‌فیزیک
preferred label: physical chemistry @en
type: Concept
related: انرژی فعال‌سازی