فعالگر
preferred label: actuator @en
type: Concept
narrower: زیرسامانۀ فعالگری

زیرسامانۀ فعالگری
scope note: مؤلفه‌های یک سامانۀ روباتی شامل فعالگرها، ابزارهای انتقال نیروهای فعالگر به پیوندها و ابزارهایی برای فراهم‌ کردن نیرو برای فعالگرها
broader: فعالگر
preferred label: actuator subsystem @en
type: Concept