فراورده لبنی
preferred label: dairy product @en
type: Concept
narrower: نوشابۀ لبنی

نوشابۀ لبنی
scope note: نوشابه‌ای که عمدتاً از شیر و فراورده‌های آن تهیه می‌شود.
broader: فراورده لبنی
preferred label: dairy beverage @en
type: Concept