ملخ هواگرد
preferred label: aircraft propeller @en
type: Concept
narrower: ملخ پرّه‌بسته

ملخ پرّه‌بسته
scope note: ملخی که پرّه‌های آن را چرخانده‌اند تا لبه‌های حمله و فرار تقریباً با خط سیر پرواز هواگَرد موازی شود و پسار به حداقل برسد و مانع از چرخش موتور شودو
broader: ملخ هواگرد
preferred label: feathered propeller @en
type: Concept