ملخ هواگرد
preferred label: aircraft propeller @en
type: Concept
narrower: ملخ اَبَرصوتی

ملخ اَبَرصوتی
scope note: ملخی که بخش اعظم سطح پرّه‌های آن برای کار در سرعت نسبی اَبَرصوتی طراحی شده است.
broader: ملخ هواگرد
preferred label: supersonic propeller @en
type: Concept