افزاره بازداری (هواگرد)
preferred label: arresting device (aircraft) @en
type: Concept
narrower: بافه بازدار هواگرد

بافه بازدار هواگرد
alternative label: کابل بازدار هواپیما
scope note: بافه/کابلی مخصوص که برای کاهش سرعت هواگرد در هنگام نشستن در عرض باند، در مسیر فرود آن، نصب می‌شود.
broader: افزاره بازداری (هواگرد)
preferred label: aircraft arresting cable @en
type: Concept