قلاب بازدار هواگرد
scope note: قلابی در انتهای هواگرد که با بافه/ بافه بازدار درگیر می‌شود و هواگرد را متوقف می‌سازد.
broader: افزاره بازداری (هواگرد)
preferred label: aircraft arresting hook @en
type: Concept

افزاره بازداری (هواگرد)
preferred label: arresting device (aircraft) @en
type: Concept
narrower: قلاب بازدار هواگرد