ارابه فرود دوچرخ
scope note: ارابه فرودی که چرخ‌های اصلی آن پشت‌سر‌هم و در خط مرکزی بدنه قرار دارد
broader: ارابه فرود (هواگرد)
preferred label: bicycle landing gear @en
type: Concept

ارابه فرود (هواگرد)
preferred label: landing gear (aircraft) @en
type: Concept
narrower: ارابه فرود دوچرخ