ارابه فرود چرخِ دُم
scope note: ارابه فرودی که چرخ‌های اصلی چپ و راست و جلوی در مرکز ثقل هواگَرد و چرخ دُم در انتهای آن است.
broader: ارابه فرود (هواگرد)
preferred label: tail wheel landing gear @en
type: Concept

ارابه فرود (هواگرد)
preferred label: landing gear (aircraft) @en
type: Concept
narrower: ارابه فرود چرخِ دُم