جدایش گریزانهی
scope note: فرایندی که در آن با استفاده از نیروی مرکزگریز دو مایع را از یکدیگر یا ذره‌های جامد را از مایع یا گاز را از مایع جدا می‌کنند.
broader: گریز دادن
preferred label: centrifugal separation @en
type: Concept

گریز دادن
preferred label: centrifugation @en
type: Concept
narrower: جدایش گریزانهی