گریز دادن
preferred label: centrifugation @en
type: Concept
narrower: پالایش گریزانه‌ای

پالایش گریزانه‌ای
scope note: جدایش جامدها یا ذرات ریز از حامل‌های مایع، به‌وسیلۀ گریزانه
broader: گریز دادن
preferred label: centrifuge refining @en
type: Concept