تقطیر
preferred label: distillation @en
type: Concept
narrower: تقطیر جوی

تقطیر جوی
scope note: یکی از روش‌های جدایش که در آن عملیات تقطیر در فشار جوّ انجام می‌شود.
broader: تقطیر
preferred label: atmospheric distillation @en
type: Concept