تقطیر
preferred label: distillation @en
type: Concept
narrower: تقطیر در خلأء

تقطیر در خلأء
scope note: تقطیر در فشارهای پایین‌تر از فشار جوّ برای جلوگیری از تجزیۀ حرارتی مایع
broader: تقطیر
preferred label: vacuum distillation @en
type: Concept