استخراج مایع‌ـ مایع
preferred label: liquid-liquid extraction @en
type: Concept
narrower: استخراج ناهم‌سو

استخراج ناهم‌سو
scope note: نوعی استخراج مایع‌ـ مایع که در آن حلاّل و خوراک (feed) مخالف جهت یکدیگر جریان می‌یابند.
broader: استخراج مایع‌ـ مایع
preferred label: countercurrent extraction @en
type: Concept