صافش زیستی
scope note: فرایند عبور دادن مایع از زی‌صافی که در آن لایۀ زی‌ژلِ تشکیل‌شده در مصالح صافی، ذرات ریز و کلوئیدی و جامدات محلول را جذب و تجزیه می‌کند.
broader: صافش
preferred label: biological filtration @en
type: Concept

صافش
preferred label: filtration @en
type: Concept
narrower: صافش زیستی