جزءجزء کردن
preferred label: fractionation @en
type: Concept
narrower: جزءجزء کردن کفی

جزءجزء کردن کفی
alternative label: برخش کفی
scope note: نوعی روش جداسازی که در آن با ایجاد کف و جمع‌آوری آن جزئی از یک مایع را، ترجیحاً ازطریق برجذبش یا برجذبش در میانای گاز ـ مایع، جدا می‌کنند.
broader: جزءجزء کردن
preferred label: foam fractionation @en
type: Concept