هم‌برجذبش
scope note: برجذبش بیش از یک ماده به‌صورت هم‌زمان بر روی یک سطح
broader: برجذبش
preferred label: coadsorption @en
type: Concept

برجذبش
preferred label: adsorption @en
type: Concept
narrower: هم‌برجذبش