الکترون‌پزی
scope note: پخت سریع مادۀ پوششی با ارسال باریکۀ الکترون به سطح ماده و تشکیل رادیکال‌های آزاد و انجام واکنش بسپارش زنجیری
broader: پخت
preferred label: electron beam curing @en
type: Concept

پخت
preferred label: curing @en
type: Concept
narrower: الکترون‌پزی