نیترات‌زدایی
preferred label: denitrification @en
type: Concept
narrower: نیترات‌زدایی بی‌اکسل

نیترات‌زدایی بی‌اکسل
scope note: فرایندی که در آن نیتروژن نیترات در غیاب اکسیژن به روش زیستی به گاز نیتروژن تبدیل می‌شود.
broader: نیترات‌زدایی
preferred label: anoxic denitrification @en
type: Concept