استر
preferred label: ester @en
type: Concept
related: استری‌ شدن

واکنش شیمیایی
preferred label: chemical reaction @en
type: Concept
narrower: استری‌ شدن

استری‌ شدن
scope note: واکنش الکل با اسید که به تشکیل استر منجر می‌شود.
related: استر
broader: واکنش شیمیایی
preferred label: esterification @en
type: Concept