سوانگاری ژل‌صافشی
scope note: نوعی سوانگاری اندازه‌ای که در آن از فاز متحرک آبی برای جدایش مواد براساس وزن مولکولی آنها استفاده میشود.
broader: سوانگاری اندازه‌ای
preferred label: gel-filtration chromatography @en
type: Concept

سوانگاری اندازه‌ای
preferred label: size exclusion chromatography @en
type: Concept
narrower: سوانگاری ژل‌صافشی