تردش اسیدی
preferred label: acid embrittlement @en
type: Concept
related: تمیزکاری اسیدی

تمیزکاری اسیدی
scope note: فرایند زدودن محصولات خوردگی ازطریق تزریق اسیدهای معدنی و آلی در سازه‌های صنعتی
related: تردش اسیدی
broader: تمیزکاری
preferred label: acid cleaning @en
type: Concept

تمیزکاری
preferred label: cleaning @en
type: Concept
narrower: تمیزکاری اسیدی