شناوه نشان‌گذار
scope note: شناوه‌ای که از آن در عملیات مین‌روبی برای مشخص کردن مسیر یا منطقۀ مین‌روبیشده استفاده میشود.
broader: شناوه
preferred label: dan buoy @en
type: Concept

شناوه
preferred label: buoy @en
type: Concept
narrower: شناوه نشان‌گذار