هواگرد
preferred label: aircraft @en
type: Concept
narrower: هواگرد بازرگانی
related: هواگرد بازرگانی

هواگرد بازرگانی
scope note: هواگَردی برای سفر بازرگانان و مدیران اجرایی
broader: هواگرد
preferred label: Untranslated Term @en
type: Concept