نشانک‌دهی
preferred label: signaling @en
type: Concept
narrower: نشانک‌دهی کاربربه‌کاربر

نشانک‌دهی کاربربه‌کاربر
alternative label: سیگنال‌دهی کاربربه‌کاربر
scope note: خدماتی که کاربر با استفاده از آن می‌تواند اطلاعات محدودی را ازطریق مسیر نشانک‌دهی/ سیگنال‌دهی وابسته به برخوان، به کاربر دیگری منتقل کند یا از او اطلاعات بگیرد.
broader: نشانک‌دهی
preferred label: user to user signaling @en
type: Concept