رادیوی سیار شخصی
scope note: سامانۀ ارتباطات رادیویی سیاری که ارائه‌دهندگان خدمات اضطراری، ازجمله نیروی انتظامی و آتش‌نشانی و فوریت‌های پزشکی و نیز سامانه‌های مسافربری، از آن عمدتاً برای نظارت بر ناوگان خود استفاده می‌کنند.
broader: رادیو
preferred label: private mobile radio @en
type: Concept

رادیو
preferred label: radio @en
type: Concept
narrower: رادیوی سیار شخصی