تلفن
preferred label: telephone @en
type: Concept
narrower: تلفن پیام‌نما

تلفن پیام‌نما
scope note: دستگاهی که از ارتباطات نگاره‌ای در ارسال نشانک‌ها/ سیگنال‌های کدبندی‌شده در شبکۀ تلفن استاندارد استفاده می‌کند.
broader: تلفن
preferred label: text telephone @en
type: Concept