تلویزیون
preferred label: television @en
type: Concept
narrower: تلویزیون بافه‌ای

تلویزیون بافه‌ای
alternative label: تلویزیون کابلی
scope note: سامانۀ پخش برنامه‌های تلویزیونی ازطریق بافه/ کابل برای مشترکان
broader: تلویزیون
preferred label: cable television @en
type: Concept