تلویزیون
preferred label: television @en
type: Concept
narrower: تلویزیون ماهواره‌ای

تلویزیون ماهواره‌ای
scope note: هرگونه سامانۀ ماهواره‌ای که علائم تلویزیونی را از فرستنده‌های زمینی جمع‌آوری کرده و پس از تقویت و مدوله‌سازی ازطریق باند ریزموج به زمین و گیرنده‌های تلویزیونی می‌رساند.
broader: تلویزیون
preferred label: satellite television @en
type: Concept