مخابرات
preferred label: telecommunication @en
type: Concept
narrower: مخابرات شخصی جهانی

مخابرات شخصی جهانی
scope note: خدماتی که به کاربران تلفن همراه امکان می‌دهد تا ازطریق شمارۀ مستقل، ارتباط مخابراتی برقرار کنند.
broader: مخابرات
preferred label: universal personal telecommunications @en
type: Concept