رقابت
scope note: تلاش افراد یک یا چند گونه برای تصرف منابع زیستی ناکافی مشترک
related: اقتصاد
preferred label: competition @en
type: Concept

اقتصاد
preferred label: economics @en
type: Concept
related: رقابت