عدسی ناستیگمات‌ساز
scope note: عدسی مرکبی که آستیگماتی را کمینه می‌کند و اَبیراهی‌های رنگی و کروی را در سامانۀ اپتیکی کاهش می‌‌دهد.
broader: عدسی
preferred label: anastigmatic lens @en
type: Concept

عدسی
preferred label: lens @en
type: Concept
narrower: عدسی ناستیگمات‌ساز