عدسی دوربین
preferred label: camera lens @en
type: Concept
narrower: عدسی زاویه‌بسته

عدسی زاویه‌بسته
scope note: عدسی دوربینی که میدان دید زاویه‌ای آن کمتر از 60 درجه باشد.
broader: عدسی دوربین
preferred label: narrow-angle lens @en
type: Concept