عدسی دوربین
preferred label: camera lens @en
type: Concept
narrower: عدسی زاویه‌معمولی

عدسی زاویه‌معمولی
scope note: عدسی دوربینی که میدان دید زاویه‌ای آن بین 60 تا 75 درجه باشد.
broader: عدسی دوربین
preferred label: normal-angle lens @en
type: Concept