یاتاقان میل‌بادامک
scope note: یاتاقان لغزشی که میل‌بادامک را در محل خود نگه می‌دارد.
broader: یاتاقان (قسمت‌های ماشین)
preferred label: camshaft bearing @en
type: Concept

یاتاقان (قسمت‌های ماشین)
preferred label: bearing (machine parts) @en
type: Concept
narrower: یاتاقان میل‌بادامک