یاتاقان‌گرد میل‌بادامک
scope note: قسمتی از میل‌بادامک که در یاتاقان میل‌بادامک می‌چرخد.
broader: یاتاقان‌گرد
preferred label: camshaft journal @en
type: Concept

یاتاقان‌گرد
preferred label: journal bearing @en
type: Concept
narrower: یاتاقان‌گرد میل‌بادامک