پیستون ساییده
scope note: پیستونی که قطر بدنۀ آن براثر گرما و نیروهای وارد بر آن کاهش یافته باشد.
broader: پیستون موتور
preferred label: collapsed piston @en
type: Concept

پیستون موتور
preferred label: engine piston @en
type: Concept
narrower: پیستون ساییده