مقاومت تنظیم‌پذیر
scope note: جزئی از مدار که مقاومت آن به‌طور مکانیکی قابل تغییر است.
broader: مقاومت
preferred label: adjustable resistor @en
type: Concept

مقاومت
preferred label: resistor @en
type: Concept
narrower: مقاومت تنظیم‌پذیر