مقاومت کربنی
alternative label: مقاومت ترکیبی
scope note: مقاومتی الکتریکی که با پختن آمیزه‌ای از ذرات کربن و سرامیک به ‌دست می‌آید.
broader: مقاومت
preferred label: carbon resistor @en
type: Concept

مقاومت
preferred label: resistor @en
type: Concept
narrower: مقاومت کربنی